{"text_format":"1","workbook":"xlsx","n_sheets":10,"sheets":["Pack A","Pack B","highlevel Pack A","highlevel Pack B","Pack A Cost Breakdown L1","Cost Breakdown Pack B L2","Package B Cost Break Down L1","Data Sheet","EE Summary","Summary"],"not_rendered":{"charts":0,"images":4,"macros":1,"external_links":1,"defined_names":10,"comments":1,"pivot_tables":0},"unopened":[],"bounds":{"document_bytes":16777216,"sheet_cells":100000,"rows_first":2000,"rows_last":500,"rows_between":2000,"halvings":0,"cell_chars":16384,"cell_head_chars":4096},"cells_cut":0,"cells_raw":0,"read":"whole","date_system":"1900"}

{"sheet":"Pack A","index":0,"n_rows":30,"n_cols":26,"rows_kept":30,"cut":false,"hidden":false,"merged":[[29,14,29,15]]}
[null,null,null,null,null,null,null,null,"  IITS for Green Line BRTS",null,null,null,null,null,null,null,null,160,"\n","common","AFC","AVM","RTPI","BI","DMS"]
[null,null,null,null,null,"List of Consumables Package A",null,null,null,null,null,null,null,null,null,null,null,null,"\n",null,null,null,null,null,{"$f":"SUMIF(T8:T24,Y1,X8:Y24)","v":0}]
[null,null,null,null,null,null,null,null,null,null,null,null,null,null,null,null,null,null,"\n",null,8.9999999999999993E-3]
["Chapter",null,null,"Alternativen: Mit Buchstaben durchzählen","Optionen","Pos.","A=Alternative\nO=Optional","A or O: chosen","Item description","unit","no.","cost per item\n(gross)\n[ PKR ]","cost per item\n(gross)\n[ USD ]","Financial comments on items","cost per position\n(gross)\n[ PKR ]","cost per position  \noptional items\n(gross)  \n[ PKR ]",null,null,null,null,null,null,{"$f":"SUM(W8:W24)","v":6763211743.7592125},{"$f":"SUM(X8:X24)","v":60868905.693832904}]
[null,null,null,null,null,null,null,null,null,null,null,null,null,null,{"$f":"SUM(O8:O24)","v":0},{"$f":"SUM(P8:P24)","v":0},null,null,"\n","System",null,"PKR per Item","PKR Gross","$ Gross"]
[1,{"$f":"IF(A6=\"\",B5,A6)","v":1},{"$f":"IF(B6=B5,IF(OR(O6=\"\",AND(D6<>\"\",D6<>\"a\")),C5,C5+1),0)","v":0},null,null,{"$f":"\"Title \"&A6","v":"Title 1"},"List of Consumables Package A",null,null,null,"",null,null,null,null,null,{"$f":"SUM(O8:O24)","v":0},{"$f":"SUM(P8:P24)","v":0},"\n",null,null,null,null,null,{"$f":"F6","v":"Title 1"},{"$f":"SUM(X8:X9)","v":0}]
[null,1,0,null,null,null,"Consumables",null,null,null,null,null,null,null,null,null,null,null,"\n",null,null,null,null,null,null,{"$f":"SUM(X8:X9)","v":0}]
[null,{"$f":"IF(A8=\"\",B7,A8)","v":1},{"$f":"IF(B8=B7,IF(OR(O8=\"\",AND(D8<>\"\",D8<>\"a\")),C7,C7+1),0)","v":1},null,null,{"$f":"B8&\".\"&REPT(\"0\",3-LEN(C8))&C8&D8","v":"1.001"},null,null,"Batteries for UPS for Central Clearing House System","sets",4,null,null,null,{"$f":"IF($G8=\"\",IF($M8=\"\",$K8*L8,$K8*M8*$R$1),IF($H8=\"\",\"(not chosen)\",IF($M8=\"\",$K8*L8,$K8*M8*$R$1)))","v":0},{"$f":"IF($G8=\"o\",IF($H8<>\"\",\"(chosen)\",IF(ISBLANK($M8),$K8*L8,$K8*$M8*$R$1)),\"\")","v":""},null,null,"\n"]
[null,1,2,null,null,{"$f":"B9&\".\"&REPT(\"0\",3-LEN(C9))&C9&D9","v":"1.002"},null,null,"Batteries for UPS for Disaster (standby) System","sets",4,null,null,null,0,"",null,null,"\n"]
[null,{"$f":"IF(A10=\"\",B9,A10)","v":1},{"$f":"IF(B10=B9,IF(OR(O10=\"\",AND(D10<>\"\",D10<>\"a\")),C9,C9+1),0)","v":3},null,null,{"$f":"B10&\".\"&REPT(\"0\",3-LEN(C10))&C10&D10","v":"1.003"},{"$f":"IF(D10<>\"\",\"a\",IF(E10<>\"\",\"o\",\"\"))","v":""},null,"Batteries for UPS for BIAS Sever System","sets",4,null,null,null,{"$f":"IF($G10=\"\",IF($M10=\"\",$K10*L10,$K10*M10*$R$1),IF($H10=\"\",\"(not chosen)\",IF($M10=\"\",$K10*L10,$K10*M10*$R$1)))","v":0},{"$f":"IF($G10=\"o\",IF($H10<>\"\",\"(chosen)\",IF(ISBLANK($M10),$K10*L10,$K10*$M10*$R$1)),\"\")","v":""},null,null,"\n","BI",null,100000,{"$f":"V10*K10","v":400000},{"$f":"W10*$U$3","v":3599.9999999999995}]
{"$rows_left_out":21}
{"sheet":"Pack B","index":1,"n_rows":25,"n_cols":18,"rows_kept":25,"cut":false,"hidden":false,"merged":[[24,14,24,15]]}
[null,null,null,null,null,null,null,null," IITS for Green Line BRTS",null,null,null,null,null,null,null,null,160]
[null,null,null,null,null,"List of Consumables Package B"]
[]
["Chapter",null,null,"Alternativen: Mit Buchstaben durchzählen","Optionen","Pos.","A=Alternative\nO=Optional","A or O: chosen","Item description","unit","no.","cost per item\n(gross)\n[ PKR ]","cost per item\n(gross)\n[ USD ]","Financial comments on items","cost per position\n(gross)\n[ PKR ]","cost per position  \noptional items\n(gross)  \n[ PKR ]"]
[0,null,null,null,null,null,null,null,null,null,null,null,null,null,{"$f":"SUM(O8:O19)","v":0},{"$f":"SUM(P8:P19)","v":0}]
[{"$f":"B5+1","v":1},{"$f":"IF(A6=\"\",B5,A6)","v":1},{"$f":"IF(B6=B5,IF(OR(O6=\"\",AND(D6<>\"\",D6<>\"a\")),C5,C5+1),0)","v":0},null,null,{"$f":"\"Title \"&A6","v":"Title 1"},"List of Consumables Package B",null,null,null,"",null,null,null,null,null,{"$f":"SUM(O8:O19)","v":0},{"$f":"SUM(P8:P19)","v":0}]
[null,1,{"$f":"IF(B7=B6,IF(OR(O7=\"\",AND(D7<>\"\",D7<>\"a\")),C6,C6+1),0)","v":0},null,null,null,"Consumables"]
[null,{"$f":"IF(A8=\"\",B7,A8)","v":1},{"$f":"IF(B8=B7,IF(OR(O8=\"\",AND(D8<>\"\",D8<>\"a\")),C7,C7+1),0)","v":1},null,null,{"$f":"B8&\".\"&REPT(\"0\",3-LEN(C8))&C8&D8","v":"1.001"},{"$f":"IF(D8<>\"\",\"a\",IF(E8<>\"\",\"o\",\"\"))","v":""},null,"Batteries for UPS of EMS Workstations","sets",4,null,null,null,{"$f":"IF($G8=\"\",IF($M8=\"\",$K8*L8,$K8*M8*$R$1),IF($H8=\"\",\"(not chosen)\",IF($M8=\"\",$K8*L8,$K8*M8*$R$1)))","v":0},{"$f":"IF($G8=\"o\",IF($H8<>\"\",\"(chosen)\",IF(ISBLANK($M8),$K8*L8,$K8*$M8*$R$1)),\"\")","v":""}]
[null,1,2,null,null,{"$f":"B9&\".\"&REPT(\"0\",3-LEN(C9))&C9&D9","v":"1.002"},{"$f":"IF(D9<>\"\",\"a\",IF(E9<>\"\",\"o\",\"\"))","v":""},null,"Batteries for UPS 5 kVA","sets",4,null,null,null,{"$f":"IF($G9=\"\",IF($M9=\"\",$K9*L9,$K9*M9*$R$1),IF($H9=\"\",\"(not chosen)\",IF($M9=\"\",$K9*L9,$K9*M9*$R$1)))","v":0},{"$f":"IF($G9=\"o\",IF($H9<>\"\",\"(chosen)\",IF(ISBLANK($M9),$K9*L9,$K9*$M9*$R$1)),\"\")","v":""}]
[null,1,3,null,null,"1.003","",null,"Batteries for UPS 2 KVA","sets",4,null,null,null,0,""]
{"$rows_left_out":16}
{"sheet":"highlevel Pack A","index":2,"n_rows":7,"n_cols":11,"rows_kept":7,"cut":false,"hidden":false,"merged":[[5,10,7,10]]}
[null,null,{"$f":"'Pack A'!I1","v":"  IITS for Green Line BRTS"}]
[]
["IITS Green Line Package A"]
[{"$f":"'Pack A'!F4","v":"Pos."},{"$f":"'Pack A'!I4&\" - \"&'Pack A'!F2","v":"Item description - List of Consumables Package A"},{"$f":"'Pack A'!I4","v":"Item description"},{"$f":"'Pack A'!J4","v":"unit"},{"$f":"'Pack A'!K4","v":"no."},{"$f":"'Pack A'!L4","v":"cost per item\n(gross)\n[ PKR ]"},{"$f":"'Pack A'!N4","v":"Financial comments on items"},{"$f":"'Pack A'!O4","v":"cost per position\n(gross)\n[ PKR ]"},{"$f":"'Pack A'!P4","v":"cost per position  \noptional items\n(gross)  \n[ PKR ]"},"EE Mandatory items (Gross $)","EE Mandatory items (Gross PKR)"]
[null,"Total",null,null,null,null,null,{"$f":"'Pack A'!O5","v":0},{"$f":"'Pack A'!P5","v":0},{"$f":"SUM(J6:J8)","v":0},{"$f":"SUM(K6:K8)","v":0}]
[{"$f":"'Pack A'!F6","v":"Title 1"},{"$f":"'Pack A'!G6","v":"List of Consumables Package A"},null,null,null,null,null,{"$f":"'Pack A'!Q6","v":0},{"$f":"'Pack A'!R6","v":0},{"$f":"INDEX('Pack A'!$Z$6:$Z$24,MATCH(A6,'Pack A'!$Y$6:$Y$24,0))","v":0},{"$f":"'Pack A'!Q6","v":0}]
[null,{"$f":"'Pack A'!G7","v":"Consumables"}]

{"sheet":"highlevel Pack B","index":3,"n_rows":6,"n_cols":4,"rows_kept":6,"cut":false,"hidden":false,"merged":[]}
[]
[]
[null,"IITS Green Line Package B"]
[{"$f":"'Pack B'!F4","v":"Pos."},{"$f":"'Pack B'!I4&\" - \"&'Pack B'!F2","v":"Item description - List of Consumables Package B"},{"$f":"'Pack B'!O4","v":"cost per position\n(gross)\n[ PKR ]"},{"$f":"'Pack B'!P4","v":"cost per position  \noptional items\n(gross)  \n[ PKR ]"}]
[null,null,{"$f":"SUM(C6:C6)","v":0},{"$f":"'Pack B'!P5","v":0}]
[{"$f":"'Pack B'!F6","v":"Title 1"},{"$f":"'Pack B'!G6","v":"List of Consumables Package B"},{"$f":"'Pack B'!Q6","v":0},{"$f":"'Pack B'!R6","v":0}]

{"sheet":"Pack A Cost Breakdown L1","index":4,"n_rows":69,"n_cols":25,"rows_kept":69,"cut":false,"hidden":true,"merged":[[3,6,3,9]]}
[null,null,null,null,null,null,null,null,null,null,null,null,null,"2019-10-29",null,null,null,null,null,"CD","ST","IT","ACD"]
[null,null,null,null,null,null,null,null,null,null,null,null,null,null,null,null,null,"HW tax & Duties",null,0.03,0.17,5.5E-2,0.02,{"$f":"SUM(T2:W2)-U2","v":0.10500000000000001},{"$f":"100%-X2","v":0.89500000000000002}]
["IITS Green Line Package A Engineer's Estimate Breakdown",null,null,null,null,null,null,null,null,null,null,null,null,null,null,null,null,"SW Tax & duties",null,0.11,0.17,5.5E-2,0.02,{"$f":"SUM(T3:W3)-U3","v":0.18500000000000003},{"$f":"100%-X3","v":0.81499999999999995}]
[{"$f":"'Pack A'!F4","v":"Pos."},{"$f":"'Pack A'!I4&\" - \"&'Pack A'!F2","v":"Item description - List of Consumables Package A"},{"$f":"'Pack A'!J4","v":"unit"},"qty",{"$f":"'Pack A'!L4","v":"cost per item\n(gross)\n[ PKR ]"},"Amount","Taxes and duties",null,null,null,"Unit cost witout GST","Unitcost with GST","Total Amount without GST","Total Amount with GST",null,null,null,"Services",null,0,0.13,5.5E-2,0,{"$f":"SUM(T4:W4)-U4","v":5.4999999999999993E-2},{"$f":"100%-X4","v":0.94500000000000006}]
[null,"Total",null,null,null,null,"CD","IT","ACD","other",null,null,{"$f":"SUM(M6:M69)","v":{"$error":"#REF!"}},{"$f":"SUM(N6:N69)","v":{"$error":"#REF!"}}]
[{"$f":"'Pack A'!F6","v":"Title 1"},{"$f":"'Pack A'!G6","v":"List of Consumables Package A"},null,null,null,null,null,null,null,null,null,null,null,null,null,null,{"$f":"SUM(Q7:Q8)","v":{"$error":"#REF!"}}]
[null,{"$f":"'Pack A'!G7","v":"Consumables"},"l.s.",1,{"$f":"Q7/($X$2+1)","v":0},{"$f":"E7*D7","v":0},{"$f":"$E7*T$2","v":0},{"$f":"$E7*V$2","v":0},{"$f":"$E7*W$2","v":0},null,{"$f":"M7/D7","v":0},{"$f":"N7/D7","v":0},{"$f":"SUM(F7:I7)","v":0},{"$f":"M7*(1+$U$2)","v":0},{"$f":"'Pack A'!Z7","v":0},{"$f":"O7/0.009","v":0},{"$f":"P7*'highlevel Pack A'!N8","v":0}]
[null,{"$f":"'Pack A'!#REF!","v":{"$error":"#REF!"}},"l.s.",1,{"$f":"Q8/($X$2+1)","v":{"$error":"#REF!"}},{"$f":"E8*D8","v":{"$error":"#REF!"}},{"$f":"$E8*T$2","v":{"$error":"#REF!"}},{"$f":"$E8*V$2","v":{"$error":"#REF!"}},{"$f":"$E8*W$2","v":{"$error":"#REF!"}},null,{"$f":"M8/D8","v":{"$error":"#REF!"}},{"$f":"N8/D8","v":{"$error":"#REF!"}},{"$f":"SUM(F8:I8)","v":{"$error":"#REF!"}},{"$f":"M8*(1+$U$2)","v":{"$error":"#REF!"}},{"$f":"'Pack A'!#REF!","v":{"$error":"#REF!"}},{"$f":"O8/0.009","v":{"$error":"#REF!"}},{"$f":"P8*'highlevel Pack A'!N8","v":{"$error":"#REF!"}}]
[{"$f":"'Pack A'!#REF!","v":{"$error":"#REF!"}},{"$f":"'Pack A'!#REF!","v":{"$error":"#REF!"}},null,null,{"$f":"Q9/($X$2+1)","v":0},{"$f":"E9*D9","v":0},{"$f":"$E9*T$2","v":0},{"$f":"$E9*V$2","v":0},{"$f":"$E9*W$2","v":0},null,null,null,null,null,null,{"$f":"O9/0.009","v":0}]
[null,{"$f":"'Pack A'!#REF!","v":{"$error":"#REF!"}},"l.s.",1,{"$error":"#REF!"},{"$error":"#REF!"},{"$error":"#REF!"},{"$error":"#REF!"},{"$error":"#REF!"},null,{"$f":"M10/D10","v":{"$error":"#REF!"}},{"$error":"#REF!"},{"$f":"SUM(F10:I10)","v":{"$error":"#REF!"}},{"$f":"M10*(1+$U$2)","v":{"$error":"#REF!"}},{"$f":"'Pack A'!#REF!","v":{"$error":"#REF!"}},{"$error":"#REF!"},{"$f":"P10*'highlevel Pack A'!#REF!","v":{"$error":"#REF!"}}]
{"$rows_left_out":60}
{"sheet":"Cost Breakdown Pack B L2","index":5,"n_rows":474,"n_cols":27,"rows_kept":474,"cut":false,"hidden":true,"merged":[[8,8,8,11]]}
[null,null,null,null,null,null,null,"2019-10-28",null,null,null,null,null,null,null,null,null,null,null,null,null,"Cd","ST","IT","ACD"]
["IITS Green Line Package B Engineer's Estimate Breakdown",null,null,null,null,null,null,null,null,null,null,null,null,null,null,null,null,null,null,"HW tax & Duties",null,0.03,0.17,5.5E-2,0.02,{"$f":"SUM(V2:Y2)-W2","v":0.10500000000000001},{"$f":"100%-Z2","v":0.89500000000000002}]
[null,null,null,null,null,null,null,null,null,null,null,null,null,null,null,null,null,null,null,"SW Tax & duties",null,0.11,0.17,5.5E-2,0.02,{"$f":"SUM(V3:Y3)-W3","v":0.18500000000000003},{"$f":"100%-Z3","v":0.81499999999999995}]
[null,null,null,null,null,null,null,null,null,null,null,null,null,null,null,null,null,null,null,"Services",null,0,0.13,5.5E-2,0,{"$f":"SUM(V4:Y4)-W4","v":5.4999999999999993E-2},{"$f":"100%-Z4","v":0.94500000000000006}]
[null,null,null,null,null,null,null,null,null,null,null,null,null,null,null,null,null,null,null,"Display Equipment",null,0.03,0.17,5.5E-2,0.02,{"$f":"SUM(V5:Y5)-W5","v":0.10500000000000001},{"$f":"100%-Z5","v":0.89500000000000002}]
[null,null,null,null,null,null,null,null,null,null,null,null,null,null,null,null,null,null,null,"Camera",null,0.11,0.17,5.5E-2,0.02,0.18500000000000003,0.81499999999999995]
[null,null,null,null,null,null,null,null,null,null,null,null,null,null,null,null,null,null,null,"Local",null,0,0.17,4.4999999999999998E-2,0,{"$f":"SUM(V7:Y7)-W7","v":4.5000000000000012E-2},{"$f":"100%-Z7","v":0.95499999999999996}]
[null,null,null,null,null,null,null,null,null,null,null,null,null,null,null,null,null,null,null,"Network Equipment",null,0.03,0.17,5.5E-2,0.02,{"$f":"SUM(V8:Y8)-W8","v":0.10500000000000001},0.89500000000000002]
["Pos.",null,"A or O: chosen","Item description","unit","no.","cost per item","Amount","Taxes and duties",null,null,null,null,null,"Total Amount without GST","Total Amount with GST"]
[null,null,null,null,null,null,null,null,"CD","IT","ACD","other","unit cost without GST","unit cost with GST",{"$f":"SUM(O13:O194)","v":{"$error":"#REF!"}},{"$f":"SUM(P13:P194)","v":{"$error":"#REF!"}}]
{"$rows_left_out":465}
{"sheet":"Package B Cost Break Down L1","index":6,"n_rows":18,"n_cols":23,"rows_kept":18,"cut":false,"hidden":true,"merged":[[3,6,3,9]]}
[null,null,null,null,null,null,null,null,null,null,null,null,null,null,null,null,null,"Cd","ST","IT","ACD"]
[null,null,null,null,null,null,null,null,null,null,null,null,null,null,null,"HW tax & Duties",null,0.03,0.17,5.5E-2,0.02,{"$f":"SUM(R2:U2)-S2","v":0.10500000000000001},{"$f":"100%-V2","v":0.89500000000000002}]
[null,"IITS Green Line Package B Engineer's Estimate",null,null,null,null,null,null,null,null,null,null,null,null,null,"SW Tax & duties",null,0.11,0.17,5.5E-2,0.02,{"$f":"SUM(R3:U3)-S3","v":0.18500000000000003},{"$f":"100%-V3","v":0.81499999999999995}]
[{"$f":"'Pack B'!F4","v":"Pos."},{"$f":"'Pack B'!I4&\" - \"&'Pack B'!F2","v":"Item description - List of Consumables Package B"},"unit","qty","cost per item","Amount","Taxes and duties",null,null,null,"Total Amount without GST","Amount with GST",null,null,null,"Services",null,0,0.13,5.5E-2,0,{"$f":"SUM(R4:U4)-S4","v":5.4999999999999993E-2},{"$f":"100%-V4","v":0.94500000000000006}]
[null,null,null,null,null,null,"CD","IT","ACD","other",{"$f":"SUM(K6:K18)","v":{"$error":"#REF!"}},{"$f":"SUM(L6:L18)","v":{"$error":"#REF!"}}]
[{"$f":"'Pack B'!F6","v":"Title 1"},{"$f":"'Pack B'!G6","v":"List of Consumables Package B"},null,1,{"$f":"O6/($V$2+1)","v":0},{"$f":"E6*D6","v":0},{"$f":"$E6*R$2","v":0},{"$f":"$E6*T$2","v":0},{"$f":"$E6*U$2","v":0},null,{"$f":"SUM(F6:J6)","v":0},{"$f":"K6*(1+$R$2)","v":0},null,{"$f":"O6","v":0},{"$f":"'highlevel Pack B'!C6","v":0}]
[{"$f":"'Pack B'!#REF!","v":{"$error":"#REF!"}},{"$f":"'Pack B'!#REF!","v":{"$error":"#REF!"}},"l.s.",1,{"$f":"O7/($V$2+1)","v":{"$error":"#REF!"}},{"$f":"E7*D7","v":{"$error":"#REF!"}},{"$f":"$E7*R$2","v":{"$error":"#REF!"}},{"$f":"$E7*T$2","v":{"$error":"#REF!"}},{"$f":"$E7*U$2","v":{"$error":"#REF!"}},null,{"$f":"SUM(F7:I7)","v":{"$error":"#REF!"}},{"$f":"K7*(1+$R$2)","v":{"$error":"#REF!"}},{"$f":"'Pack A'!AA7","v":0},{"$f":"O7","v":{"$error":"#REF!"}},{"$f":"'highlevel Pack B'!#REF!","v":{"$error":"#REF!"}}]
[{"$f":"'Pack B'!#REF!","v":{"$error":"#REF!"}},{"$f":"'Pack B'!#REF!","v":{"$error":"#REF!"}},"l.s.",1,{"$f":"O8/($V$2+1)","v":{"$error":"#REF!"}},{"$f":"E8*D8","v":{"$error":"#REF!"}},{"$f":"$E8*R$2","v":{"$error":"#REF!"}},{"$f":"$E8*T$2","v":{"$error":"#REF!"}},{"$f":"$E8*U$2","v":{"$error":"#REF!"}},null,{"$f":"SUM(F8:I8)","v":{"$error":"#REF!"}},{"$f":"K8*(1+$R$2)","v":{"$error":"#REF!"}},{"$f":"'Pack A'!#REF!","v":{"$error":"#REF!"}},{"$error":"#REF!"},{"$f":"'highlevel Pack B'!#REF!","v":{"$error":"#REF!"}}]
[{"$f":"'Pack B'!#REF!","v":{"$error":"#REF!"}},{"$f":"'Pack B'!#REF!","v":{"$error":"#REF!"}},null,1,{"$error":"#REF!"},{"$f":"E9*D9","v":{"$error":"#REF!"}},{"$error":"#REF!"},{"$error":"#REF!"},{"$error":"#REF!"},null,{"$f":"SUM(F9:I9)","v":{"$error":"#REF!"}},{"$f":"K9*(1+$R$2)","v":{"$error":"#REF!"}},null,{"$error":"#REF!"},{"$f":"'highlevel Pack B'!#REF!","v":{"$error":"#REF!"}}]
[{"$f":"'Pack B'!#REF!","v":{"$error":"#REF!"}},{"$f":"'Pack B'!#REF!","v":{"$error":"#REF!"}},"l.s.",1,{"$error":"#REF!"},{"$error":"#REF!"},{"$error":"#REF!"},{"$error":"#REF!"},{"$error":"#REF!"},null,{"$f":"SUM(F10:I10)","v":{"$error":"#REF!"}},{"$f":"K10*(1+$R$2)","v":{"$error":"#REF!"}},{"$f":"'Pack A'!#REF!","v":{"$error":"#REF!"}},{"$error":"#REF!"},{"$f":"'highlevel Pack B'!#REF!","v":{"$error":"#REF!"}}]
{"$rows_left_out":9}
{"sheet":"Data Sheet","index":7,"n_rows":152,"n_cols":28,"rows_kept":152,"cut":false,"hidden":true,"merged":[]}
["Occurance",null,null,8,4,7,1,1,1,3,2,3,80,1,1,22350,1,1,1,1,1,1,25,1,3700,"Sum GL","Sum OL","Total"]
["Station Type",null,null,"split","split","median","split","split","median","median"]
["Station Alignment",null,null,"Beside Road","median","median","median","Beside Road","median","median"]
["Bays",null,null,"2+2","2+2","3+3","3+3","2+2","2+2 2+2","2+2"]
["Build",null,null,"elevated","elevated","grade","grade","grade","grade","elevated"]
["Entry Points",null,null,7,4,4,4,5,4,4]
["special",null,null,null,null,"with passing",null,null,"with passing"]
["Category","Package",null,"A","B","C","D","E","N","U","Customer Care","POI","GL Buses","Depot","OCC","GL Corridor","OL St1 ","OL St2","OL St3","OL St4","OL St5","OL St6","OL Buses","OL Depot","OL Corridor"]
["TOM","A",9.0020000000000007,2,2,2,2,2,2,{"$f":"E9","v":2},1,1,0,0,0,0,2,2,2,2,2,2,0,0,0,{"$f":"D$1*D9+E$1*E9+F$1*F9+G$1*G9+H$1*H9+I$1*I9+J$1*J9+K$1*K9+L$1*L9","v":55},{"$f":"Q$1*Q9+R$1*R9+S$1*S9+T$1*T9+U$1*U9+V$1*V9","v":12},{"$f":"Z9+AA9","v":67}]
["TVM","A","10.002",1,2,2,2,1,1,1,0,0,0,0,0,0,1,1,1,1,1,1,0,0,0,{"$f":"D$1*D10+E$1*E10+F$1*F10+G$1*G10+H$1*H10+I$1*I10+J$1*J10+K$1*K10+L$1*L10","v":37},6,{"$f":"Z10+AA10","v":43}]
{"$rows_left_out":143}
{"sheet":"EE Summary","index":8,"n_rows":8,"n_cols":2,"rows_kept":8,"cut":false,"hidden":true,"merged":[]}
[null,"2019-10-10"]
["Green Line BRTS IITS EE Summary"]
["Package A without GST",{"$f":"'Pack A Cost Breakdown L1'!M5","v":{"$error":"#REF!"}}]
["Package A with GST",{"$f":"'Pack A Cost Breakdown L1'!N5","v":{"$error":"#REF!"}}]
["Package B without GST",{"$f":"'Cost Breakdown Pack B L2'!O10","v":{"$error":"#REF!"}}]
["Package B with GST",{"$f":"'Cost Breakdown Pack B L2'!P10","v":{"$error":"#REF!"}}]
["Total without GST",{"$f":"B3+B5","v":{"$error":"#REF!"}}]
["Total with GST",{"$f":"B4+B6","v":{"$error":"#REF!"}}]

{"sheet":"Summary","index":9,"n_rows":12,"n_cols":7,"rows_kept":12,"cut":false,"hidden":true,"merged":[[1,0,1,2]]}
[null,"2019-10-29"]
["Green Line BRTS IITS EE Summary"]
["BOQ Packages In the RFP","Without GST","With GST"]
["Package A",{"$f":"'Pack A Cost Breakdown L1'!M5","v":{"$error":"#REF!"}},{"$f":"'Pack A Cost Breakdown L1'!N5","v":{"$error":"#REF!"}},null,"pack a","wo gst","with gst"]
["Package B",{"$f":"'Cost Breakdown Pack B L2'!O10","v":{"$error":"#REF!"}},{"$f":"'Cost Breakdown Pack B L2'!P10","v":{"$error":"#REF!"}},null,1790347709.6275203,2354449734.6275206,2734841388.6526875]
["ITS Opex (3 years)",1619362200,1846072907.9999998,null,{"$f":"B4","v":{"$error":"#REF!"}},{"$f":"B4+B5","v":{"$error":"#REF!"}},{"$f":"C4+C5","v":{"$error":"#REF!"}}]
["Total (A+B + Opex)",{"$f":"B4+B5+B6","v":{"$error":"#REF!"}},{"$f":"C4+C5+C6","v":{"$error":"#REF!"}}]
[null,null,null,null,{"$f":"E5-E6","v":{"$error":"#REF!"}},{"$f":"F5-F6","v":{"$error":"#REF!"}},{"$f":"G5-G6","v":{"$error":"#REF!"}}]
[]
[null,null,null,null,1605397416]
{"$rows_left_out":2}